{"text_format":"1","workbook":"xlsx","n_sheets":14,"sheets":["Einleitung ","Daten zum Auftrag","vereinfachte Gesamtkalkulat ","Code","Personalkosten","Tabelle4","Gerätenutzungskosten","Materialkosten","Fremdleistungskosten","sonstige direkt zurechenbare Ko","Tabelle1","Tabelle2","Gesamtkalkulation","Tabelle3"],"not_rendered":{"charts":0,"images":1,"macros":0,"external_links":1,"defined_names":17,"comments":2,"pivot_tables":0},"unopened":[],"bounds":{"document_bytes":16777216,"sheet_cells":100000,"rows_first":2000,"rows_last":500,"rows_between":2000,"halvings":0,"cell_chars":16384,"cell_head_chars":4096},"cells_cut":0,"cells_raw":0,"read":"whole","date_system":"1900"}

{"sheet":"Einleitung ","index":0,"n_rows":61,"n_cols":9,"rows_kept":61,"cut":false,"hidden":false,"merged":[[32,1,32,6],[33,6,37,6],[38,1,38,2],[48,1,48,4],[33,1,37,2],[33,3,37,3],[33,4,37,4],[33,5,37,5],[9,5,9,10],[5,5,5,10],[6,5,6,10],[4,5,4,10],[8,5,8,10],[7,5,7,10]]}
[]
[]
[]
[]
[]
[null,null,null,null,null,"Kalkulationsschema für Auftragsforschung und wissenschaftliche Dienstleistung"]
[null,null,null,null,null,"Stand: April 2025"]
[]
[null,null,null,null,null,"Bitte übermitteln Sie alle folgenden Blätter nur ausgedruckt mit Originalunterschrift!"]
[null,"Liebe Nutzerin, "]
[null,"lieber Nutzer,"]
[]
[null,"mit dieser Projektkalkulation werden die Vollkosten für ein Drittmittelprojekt berechnet. Diese Vorlage ist so aufgebaut, dass nur noch bestimmte Felder gefüllt werden müssen und am Ende eine komplette"]
[null,"Vollkostenrechnung entsteht. Bitte gehen Sie nach folgender Anleitung vor."]
[]
{"$rows_left_out":47}
{"sheet":"Daten zum Auftrag","index":1,"n_rows":64,"n_cols":23,"rows_kept":64,"cut":false,"hidden":false,"merged":[[35,2,35,10],[29,0,29,6],[29,7,29,10],[7,0,7,4],[7,5,7,10],[13,0,14,3],[27,7,27,10],[27,0,27,6],[11,4,11,10],[48,1,48,5],[48,6,48,10],[45,8,45,10],[0,0,0,4],[1,0,1,9],[3,4,3,10],[5,4,5,7],[5,8,5,10],[9,4,9,10],[13,4,13,10],[14,4,14,10],[22,1,22,6],[24,1,24,6],[22,7,22,10],[24,7,24,10],[31,0,31,10]]}
["Grau markierte Felder sind vom Antragsteller auszufüllen!"]
["Daten zum Auftrag / zur Kalkulation - Auftragsforschung",null,null,null,null,null,null,null,null,null,null,null,null,null,null,null,null,null,null,null,null,null,"Partner EU (ohne USt)"]
[null,null,null,null,null,null,null,null,null,null,null,null,null,null,null,null,null,null,null,null,null,null,"Partner Hochschule Bayern (ohne Ust)"]
["Beauftragender Partner: ",null,null,null,null,null,null,null,null,null,null,null,null,null,null,null,null,null,null,null,null,null,"Partner Drittland (ohne Ust)"]
[null,null,null,null,"(Unternehmen / Firma): Bitte vollständige Anschrift angeben!",null,null,null,null,null,null,null,null,null,null,null,null,null,null,null,null,null,"Partner Inland (mit USt) 19% "]
["PARTNERLAND / USt",null,null,null,"Partner Inland (mit USt) 19% ",null,null,null,"Å Bitte auswählen!",null,null,null,null,null,null,null,null,null,null,null,null,null,"Partner EU (mit USt) 19%"]
[null,null,null,null,null,null,null,null,null,null,null,null,null,null,null,null,null,null,null,null,null,null,"Partner Drittland (mit USt) 19% "]
["Unternehmer-Nr.:/USt- Ident-Nr.:",null,null,null,null,null,null,null,null,null,null,null,null,null,null,null,null,null,null,null,null,null,"Innenleistung Lehrstuhl/Einrichtung"]
[null,null,null,null,"(Nur bei Partnern aus EU oder Drittland)"]
["Lehrstuhl/Einrichtung"]
[]
["Ansprechpartner/in Lehrstuhl:",null,null,null,null,null,null,null,null,null,null,null,null,null,null,null,null,null,null,null,null,null,"Partner Drittland (ohne Ust)"]
[]
["Projektbezeichnung"]
[]
{"$rows_left_out":50}
{"sheet":"vereinfachte Gesamtkalkulat ","index":2,"n_rows":124,"n_cols":26,"rows_kept":124,"cut":false,"hidden":false,"merged":[[0,0,0,2],[6,1,6,3],[57,0,57,1],[55,2,56,2],[52,0,52,2],[61,5,64,8],[54,5,57,8],[3,1,3,3],[4,1,4,3],[5,1,5,3]]}
["Kalkulation von Auftragsforschungen"]
["nur für Kleinprojekte bis 10.000 € Netto-Angebotspreis",null,null,null,null,null,null,null,null,null,null,null,null,null,null,null,null,"A3",null,null,null,null,null,null,0]
[null,null,null,null,null,null,null,null,null,null,null,null,null,null,null,null,null,"A4",null,null,null,null,null,null,0]
["Auftraggeber / Firma",null,null,null,null,null,null,null,null,null,null,null,null,null,null,null,null,"A5",null,null,null,null,null,null,"Partner EU (ohne USt)"]
["Ansprechpartner",null,null,null,null,null,null,null,null,null,null,null,null,null,null,null,null,"A6",null,null,null,null,null,null,"Partner Hochschule Bayern (ohne Ust)"]
["Thema",null,null,null,null,null,null,null,null,null,null,null,null,null,null,null,null,"A6+Z",null,null,null,null,null,null,"Partner Drittland (ohne Ust)"]
["Mitarbeiter",null,null,null,null,null,null,null,null,null,null,null,null,null,null,null,null,"A7",null,null,null,null,null,null,"Partner Inland (mit USt) 16%",0.16]
[null,null,null,null,null,"ERLÄUTERUNGEN:",null,null,null,null,null,null,null,null,null,null,null,"A8",null,null,null,null,null,null,"Partner EU (mit USt) 16%",0.16]
["Einsatz von Stammpersonal","Dauer","Preis","Kosten","873/874",null,null,null,null,null,null,null,null,null,null,null,null,"A9",null,null,null,null,null,null,"Partner Drittland (mit USt) 16%",0.16]
[null,null,{"$f":"IF(ISERROR(VLOOKUP(A10,Code!$A$8:$F$59,6,0)),\"\",VLOOKUP(A10,Code!$A$8:$F$59,6,0))","v":""},{"$f":"IF(ISERROR(C10*B10),\"\",C10*B10)","v":""},null,"Arbeitsplatzkosten und Grundausstattung",null,null,null,null,null,null,null,null,null,null,null,"A9+Z ",null,null,null,null,null,null,"Partner Inland (mit USt) 19% ",0.19]
[null,null,{"$f":"IF(ISERROR(VLOOKUP(A11,Code!$A$8:$F$59,6,0)),\"\",VLOOKUP(A11,Code!$A$8:$F$59,6,0))","v":""},{"$f":"IF(ISERROR(C11*B11),\"\",C11*B11)","v":""},null,null,null,null,null,null,null,null,null,null,null,null,null,"A10",null,null,null,null,null,null,"Partner EU (mit Ust) 19%",0.19]
[null,null,{"$f":"IF(ISERROR(VLOOKUP(A12,Code!$A$8:$F$59,6,0)),\"\",VLOOKUP(A12,Code!$A$8:$F$59,6,0))","v":""},{"$f":"IF(ISERROR(C12*B12),\"\",C12*B12)","v":""},null,null,null,null,null,null,null,null,null,null,null,null,null,"A10+Z",null,null,null,null,null,null,"Partner Drittland (mit USt) 19% ",0.19]
[null,null,{"$f":"IF(ISERROR(VLOOKUP(A13,Code!$A$8:$F$59,6,0)),\"\",VLOOKUP(A13,Code!$A$8:$F$59,6,0))","v":""},{"$f":"IF(ISERROR(C13*B13),\"\",C13*B13)","v":""},null,null,null,null,null,null,null,null,null,null,null,null,null,"A11",null,null,null,null,null,null,"Innenleistung Lehrstuhl/Einrichtung",0]
["Summe",null,null,{"$f":"SUM(D10:D13)","v":0},null,null,null,null,null,null,null,null,null,null,null,null,null,"A12"]
[null,null,null,null,null,null,null,null,null,null,null,null,null,null,null,null,null,"A13"]
{"$rows_left_out":110}
{"sheet":"Code","index":3,"n_rows":59,"n_cols":6,"rows_kept":59,"cut":false,"hidden":true,"merged":[[0,0,0,5],[2,0,2,5],[3,0,3,1],[3,2,3,3],[4,0,6,0],[4,2,6,2],[1,0,1,5],[3,4,3,5],[4,1,6,1],[4,5,6,5],[4,3,6,3],[4,4,6,4],[55,0,55,2],[45,0,45,1],[45,2,45,3],[26,2,26,3],[55,4,55,5],[26,0,26,1],[48,2,49,2],[45,4,45,5],[26,4,26,5]]}
["A. Auftragsspezifische Personalkosten"]
["Personalvollkosten ab 1. Dezember 2022"]
["Nur grün hinterlegte Felder ausfüllen !"]
["Beamte",null,"Angestellte",null,"Personalvollkosten_Beamte/Angestellte"]
["BesGr","Stufe","Entgelt-gruppe ","Entgeltgruppe (Übergeleiteter Bestand)","Jahr (in Euro)","Stunde (in Euro)"]
[]
[]
["A3","8*","E2, E2Ü, E1","E2Ü",73359,44.73]
["A4","8*",null,null,76080,46.4]
["A5","Endstufe","E3","E3",76740,46.8]
["A6",null,"E5, E4",null,77613,47.32]
["A6+Z","Endstufe",null,null,80709,49.22]
["A7",7,"E7, E6","E7, E6",81088,49.44]
["A8","Endstufe","E8","E8",88155,53.76]
["A9",null,"E9","E9",91031,55.24]
{"$rows_left_out":45}
{"sheet":"Personalkosten","index":4,"n_rows":60,"n_cols":22,"rows_kept":60,"cut":false,"hidden":false,"merged":[[49,0,50,0],[42,16,42,18],[46,11,47,11],[28,8,28,12],[7,15,7,17],[46,0,47,0],[46,10,47,10],[9,15,9,17],[8,15,8,17],[27,8,27,12],[27,0,27,7],[28,0,28,7],[43,16,43,18],[41,0,41,2],[12,15,12,18],[46,9,47,9],[49,2,50,8],[46,2,47,8],[49,9,50,9],[46,13,47,13],[49,13,50,13],[46,12,47,12],[49,10,50,10],[4,6,6,6],[3,2,3,3],[4,12,6,12],[0,0,0,9],[1,0,1,9],[4,8,6,8],[3,9,6,9],[4,3,6,3],[3,11,6,11],[2,0,2,13],[4,0,6,0],[3,4,3,5],[13,15,32,18],[44,16,44,18],[53,0,53,2],[3,13,6,13],[4,2,6,2],[3,0,3,1],[3,15,5,17],[49,11,50,11],[49,12,50,12],[3,6,3,7],[33,2,34,3],[4,1,6,1],[4,10,6,10],[4,7,6,7],[4,4,6,4],[4,5,6,5]]}
["A. Auftragsspezifische Personalkosten"]
["Personalvollkosten ab Dezember 2022",null,null,null,null,null,null,null,null,null,null,null,null,null,null,"ANMERKUNGEN:"]
["Nur grün hinterlegte Felder ausfüllen !"]
["Beamte",null,"Angestellte",null,"Personaldurchschnittskosten",null,"Personalvollkosten",null,"Std.","Beamte Stammpersonal = vorhandenes Lehrstuhlpersonal, das über eine Haushaltsstelle finanziert wird","Std.","Angestellte Stammpersonal = vorhandenes Lehrstuhlpersonal, das über eine Haushaltsstelle finanziert wird","Std.","Direkteinstellungen= Personal, welches eigens für die Durchführung des Vorhabens auf das Projekt eingestellt wird",null,"Die Arbeitsplatzkosten und die Grundausstattung sind bei den Personalvollkosten mit eingerechnet."]
["BesGr","Stufe","Entgelt-gruppe ","Entgelt-gruppe (Über-geleiteter Bestand)","Jahr (in Euro)","Stunde (in Euro)","Jahr                      (in Euro)","Stunde                   (in Euro)"]
[]
[]
["A3","Endstufe","E2, E2Ü, E1","E2Ü",null,null,{"$f":"Code!$E8","v":73359},{"$f":"VLOOKUP(A8,Code!$A$5:$F$26,6,0)","v":44.73},null,{"$f":"H8*I8","v":0},null,{"$f":"K8*H8","v":0},null,{"$f":"H8*M8","v":0},null,"Stunden pro Jahr",null,null,1720]
["A4","Endstufe",null,null,null,null,{"$f":"Code!$E9","v":76080},{"$f":"VLOOKUP(A9,Code!$A$5:$F$26,6,0)","v":46.4},null,{"$f":"H9*I9","v":0},null,{"$f":"K9*H9","v":0},null,{"$f":"H9*M9","v":0},null,"Stunden pro Monat",null,null,{"$f":"S8/12","v":143.33333333333334}]
["A5","Endstufe","E3","E3",null,null,{"$f":"Code!$E10","v":76740},{"$f":"VLOOKUP(A10,Code!$A$5:$F$26,6,0)","v":46.8},null,{"$f":"H10*I10","v":0},null,0,null,0,null,"Stunden pro Tag",null,null,{"$f":"S9/19","v":7.5438596491228074}]
["A6",null,"E5, E4",null,null,null,{"$f":"Code!$E11","v":77613},{"$f":"VLOOKUP(A11,Code!$A$5:$F$26,6,0)","v":47.32},null,0,null,{"$f":"K11*H11","v":0},null,0]
["A6+Z","Endstufe",null,null,null,null,{"$f":"Code!$E12","v":80709},{"$f":"VLOOKUP(A12,Code!$A$5:$F$26,6,0)","v":49.22},null,0,null,0,null,0]
["A7",8,"E7, E6","E7, E6",null,null,{"$f":"Code!$E13","v":81088},{"$f":"VLOOKUP(A13,Code!$A$5:$F$26,6,0)","v":49.44},null,0,null,0,null,0,null,"Forschungs- und Lehrzulage"]
["A8","Endstufe","E8","E8",null,null,{"$f":"Code!$E14","v":88155},{"$f":"VLOOKUP(A14,Code!$A$5:$F$26,6,0)","v":53.76},null,0,null,0,null,{"$f":"H14*M14","v":0},null,"Professoren und Professorinnen, die im Hauptamt Mittel privater Dritter für Forschungs- und Lehrvorhaben der Hochschule einwerben und diese Vorhaben durchführen, kann für die Dauer des Drittmittelflusses aus diesen Mitteln eine nicht ruhegeltfähige Zulage gewährt werden, soweit der Drittmittelgeber mit der Vergabe einverstanden ist. Eine Zulage darf nur gewährt werden, soweit neben den übrigen Kosten des Forschungs- und Lehrvorhabens auch die für die Gewährung der Forschungs- und Lehrzulage aufzuwendenden Beträge durch die Drittmittel gedeckt sind. Forschungs- und Lehrzulagen dürfen innerhalb eines Kalenderjahres insgesamt 100 v. H. des Jahresgrundgehalts des Professors oder der Professorin nicht überschreiten. Die Lehrtätigkeit im Rahmen eines Lehrvorhabens, für das eine Lehrzulage gewährt wird, ist auf die jeweils obliegende Lehrverpflichtung nicht anzurechnen.                           Anm.: Die BayHLeistBV ist nur auf Professoren in der W-Besoldung anwendbar."]
["A9",null,"E9","E9",null,null,{"$f":"Code!$E15","v":91031},{"$f":"VLOOKUP(A15,Code!$A$5:$F$26,6,0)","v":55.24},null,0,null,0,null,0]
{"$rows_left_out":46}
{"sheet":"Tabelle4","index":5,"n_rows":0,"n_cols":0,"rows_kept":0,"cut":false,"hidden":true,"merged":[]}

{"sheet":"Gerätenutzungskosten","index":6,"n_rows":35,"n_cols":13,"rows_kept":35,"cut":false,"hidden":false,"merged":[[26,10,26,13],[21,10,21,13],[1,10,2,14],[13,10,19,13],[5,10,5,13],[8,10,10,13],[7,12,7,13],[1,0,1,8],[22,10,25,13],[2,5,2,6],[16,5,16,6],[24,5,25,7],[10,5,10,6],[11,5,11,6],[12,5,12,6],[17,5,17,6],[18,5,18,6],[13,5,13,6],[3,8,5,8],[3,5,5,6],[3,7,5,7],[14,5,14,6],[19,5,19,6],[20,5,20,6],[21,5,21,6],[15,5,15,6],[23,5,23,6],[22,5,22,6],[21,0,21,3],[17,0,17,3],[7,0,7,3],[8,0,8,3],[9,0,9,3],[14,0,14,3],[10,0,10,3],[18,0,18,3],[19,0,19,3],[20,0,20,3],[15,0,15,3],[16,0,16,3],[0,0,0,8],[2,0,2,3],[24,8,25,8],[6,5,6,6],[7,5,7,6],[8,5,8,6],[9,5,9,6],[24,0,25,3],[23,0,23,3],[22,0,22,3],[3,0,5,3],[3,4,5,4],[6,0,6,3],[11,0,11,3],[12,0,12,3],[13,0,13,3]]}
["Gerätenutzungskosten",null,null,null,null,null,null,null,null,null,"ANMERKUNGEN:"]
["Nur grün hinterlegte Felder ausfüllen !",null,null,null,null,null,null,null,null,null,"Die (Netto-)Vollkosten pro Stunde sind bei Herrn Grunert anzufragen."]
["Maschinen",null,null,null,null,"Vollkosten ",null,"Stunden","Anlagekosten"]
[null,null,null,null,"Inventar- nummer","pro Stunde in Euro",null,null,"in Euro       (netto)"]
[]
[null,null,null,null,null,null,null,null,null,null,"Beispiel"]
["Maschine 1",null,null,null,null,0,null,null,{"$f":"H7*F7","v":0},null,"Vollkosten","Stunden","Anlagenkosten (in Euro)"]
["Maschine 2",null,null,null,null,0,null,null,0,null,25,40.1,{"$f":"L8*K8","v":1002.5}]
["Maschine 3",null,null,null,null,0,null,null,0,null,"Die Zahl 40,1 bedeutet z. B. eine Wochenbetriebszeit von 40,06 Stunden, wenn Sie für eine Tätigkeit 90 Minuten brauchen, tragen Sie bei Stunden bitte 1,5 ein."]
["Maschine 4",null,null,null,null,0,null,null,0]
["Maschine 5",null,null,null,null,0,null,null,0]
["Maschine 6",null,null,null,null,0,null,null,0]
["Maschine 7",null,null,null,null,0,null,null,0]
["Maschine 8",null,null,null,null,0,null,null,0,null,"In den Gerätenutzungskosten sind bereits mit eingerechnet:                                         Abschreibung, kalkulatorische Zinsen, tatsächliche Reparaturkosten, Raumkosten nach beanspruchter Fläche, Betriebsstoffe (Gas, Helium, Stickstoffe, Öl, etc.), Verbrauchsmaterial, Wartungs- und Gemeinkosten"]
["Maschine 9",null,null,null,null,0,null,null,0]
{"$rows_left_out":21}
{"sheet":"Materialkosten","index":7,"n_rows":31,"n_cols":14,"rows_kept":31,"cut":false,"hidden":false,"merged":[[6,8,6,13],[7,0,7,2],[0,0,0,6],[2,5,6,5],[2,6,6,6],[2,0,6,0],[2,3,6,3],[1,0,1,6],[2,4,6,4],[2,1,6,2],[7,13,11,13],[8,0,8,2],[11,0,11,2],[12,0,12,2],[9,0,9,2],[10,0,10,2],[25,0,25,2],[26,0,26,2],[27,0,28,3],[27,4,28,5],[13,0,13,2],[14,0,14,2],[15,0,15,2],[16,0,16,2],[17,0,17,2],[30,0,31,3],[30,4,31,5],[30,6,31,6],[7,11,11,11],[7,12,11,12],[12,8,12,9],[7,8,11,9],[7,10,11,10],[20,0,20,2],[18,0,18,2],[19,0,19,2],[21,0,21,2],[22,0,22,2],[27,6,28,6],[23,0,23,2],[24,0,24,2]]}
["Materialkosten",null,null,null,null,null,null,null,"ANMERKUNGEN:"]
["Nur grün hinterlegte Felder ausfüllen !"]
["eingesetztes Material","Verbrauchsmaterial, Chemikalien, etc.",null,"Preis einer Einheit          in Euro (netto)","Einheit,         z. B. kg, l, etc.","Menge","Gesamt- preis           in Euro (netto)",null,"Material ist einzeln zu kalkulieren, kann aber auch pauschal"]
[null,null,null,null,null,null,null,null,"angesetzt werden z.B. \"Chemikalien insgesamt\""]
[]
[]
[null,null,null,null,null,null,null,null,"Beispiel"]
["Material 1",null,null,0,null,null,{"$f":"D8*F8","v":0},null,"eingesetzes Material       z. B. Chemikalien",null,"Preis einer Einheit in Euro","Einheit","Menge","Gesamt- preis                 in Euro"]
["Material 2",null,null,0,null,null,0]
["Material 3",null,null,0,null,null,0]
["Material 4",null,null,0,null,null,0]
["Material 5",null,null,0,null,null,0]
["Material 6",null,null,0,null,null,0,null,"Chemikalien",null,7.5,"kg",200,{"$f":"M13*K13","v":1500}]
["Material 7",null,null,0,null,null,0]
["Material 8",null,null,0,null,null,0]
{"$rows_left_out":17}
{"sheet":"Fremdleistungskosten","index":8,"n_rows":28,"n_cols":13,"rows_kept":28,"cut":false,"hidden":false,"merged":[[0,0,0,6],[7,0,7,2],[8,0,8,2],[2,0,6,0],[2,1,6,2],[1,0,1,6],[27,6,28,6],[2,3,6,3],[2,4,6,4],[2,5,6,5],[2,6,6,6],[27,0,28,3],[27,4,28,5],[9,0,9,2],[10,0,10,2],[11,0,11,2],[24,0,24,2],[26,0,26,2],[19,0,19,2],[20,0,20,2],[21,0,21,2],[22,0,22,2],[7,12,11,12],[12,8,12,9],[7,10,11,10],[23,0,23,2],[17,0,17,2],[18,0,18,2],[12,0,12,2],[13,0,13,2],[14,0,14,2],[7,11,11,11],[7,8,11,9],[15,0,15,2],[16,0,16,2]]}
["Fremdleistungen",null,null,null,null,null,null,null,"ANMERKUNGEN:"]
["Nur grün hinterlegte Felder ausfüllen !"]
["Fremdleistung ","Vergabe von Aufträgen an Universitätsfremde, z. B. Gutachten, TÜV, Messungen, etc.",null,"Preis einer Einheit        in Euro (netto)","Einheit,       z. B. Std.","Menge","Gesamtpreis                   in Euro (netto)",null,"Weitere Fremdleistungen sind"]
[null,null,null,null,null,null,null,null,"z. B. Reparaturen, Wartungsarbeiten, etc."]
[]
[]
[null,null,null,null,null,null,null,null,"Beispiel"]
["Fremdleistung 1",null,null,0,null,null,{"$f":"F8*D8","v":0},null,"Fremdleistung ",null,"Preis einer Einheit          in Euro","Menge","Gesamt- preis          in Euro"]
["Fremdleistung 2",null,null,0,null,null,0]
["Fremdleistung 3",null,null,0,null,null,0]
["Fremdleistung 4",null,null,0,null,null,0]
["Fremdleistung 5",null,null,0,null,null,0]
["Fremdleistung 6",null,null,0,null,null,0,null,"TÜV-Gutachten",null,100,2,{"$f":"L13*K13","v":200}]
["Fremdleistung 7",null,null,0,null,null,0]
["Fremdleistung 8",null,null,0,null,null,0]
{"$rows_left_out":14}
{"sheet":"sonstige direkt zurechenbare Ko","index":9,"n_rows":42,"n_cols":13,"rows_kept":42,"cut":false,"hidden":false,"merged":[[8,0,8,4],[10,10,11,10],[10,11,11,11],[11,0,11,4],[2,7,2,12],[3,7,4,11],[5,7,5,11],[3,12,4,12],[10,12,11,12],[2,0,3,4],[2,5,3,5],[4,0,4,4],[5,0,5,4],[10,7,11,9],[6,0,6,4],[41,0,42,4],[41,5,42,5],[16,0,16,4],[17,0,17,4],[18,0,18,4],[37,0,38,2],[37,3,38,4],[19,0,20,4],[25,0,25,5],[29,3,30,3],[19,5,20,5],[29,4,30,4],[29,0,30,2],[12,7,12,9],[15,7,20,10],[12,0,12,4],[13,0,13,4],[14,0,14,4],[0,0,0,5],[37,5,38,5],[29,5,30,5],[33,0,33,2],[34,0,34,2],[35,0,35,2],[36,0,36,2],[31,0,31,2],[32,0,32,2],[15,0,15,4],[26,0,28,1],[22,0,22,4],[7,0,7,4],[9,0,9,4],[10,0,10,4],[1,0,1,5]]}
["sonstige direkt zurechenbare Kosten",null,null,null,null,null,null,"ANMERKUNGEN:"]
["Nur grün hinterlegte Felder ausfüllen !"]
["sonstige dem Auftrag zurechenbare Kosten",null,null,null,null,"Betrag in Euro (netto)",null,"Beispiele"]
[null,null,null,null,null,null,null,"sonstige dem Auftrag zurechenbare Kosten                                                 (z. B. Reisekosten, Lizenzkosten, Interne Leistungsverrechnung etc.)",null,null,null,null,"Betrag in Euro (netto)"]
["sonstige dem Auftrag direkt zurechenbaren Kosten 1",null,null,null,null,0]
["sonstige dem Auftrag direkt zurechenbaren Kosten 2",null,null,null,null,0,null,"Reisekosten",null,null,null,null,150]
["sonstige dem Auftrag direkt zurechenbaren Kosten 3",null,null,null,null,0]
["sonstige dem Auftrag direkt zurechenbaren Kosten 4",null,null,null,null,0]
["sonstige dem Auftrag direkt zurechenbaren Kosten 5",null,null,null,null,0]
["sonstige dem Auftrag direkt zurechenbaren Kosten 6",null,null,null,null,0,null,"zusätzlich nur für dieses Projekt gebuchte Räume"]
["sonstige dem Auftrag direkt zurechenbaren Kosten 7",null,null,null,null,0,null,"Raum                                                                   z. B. Konferenzräume, Hörsaale, Abstellräume, usw.",null,null,"Fläche in qm","Preis pro qm in Euro (netto)","Gesamtkosten in Euro"]
["sonstige dem Auftrag direkt zurechenbaren Kosten 8",null,null,null,null,0]
["sonstige dem Auftrag direkt zurechenbaren Kosten 9",null,null,null,null,0,null,"Lagerhalle",null,null,85,4,{"$f":"L13*K13","v":340}]
["sonstige dem Auftrag direkt zurechenbaren Kosten 10",null,null,null,null,0]
["sonstige dem Auftrag direkt zurechenbaren Kosten 11",null,null,null,null,0]
{"$rows_left_out":28}
{"sheet":"Tabelle1","index":10,"n_rows":0,"n_cols":0,"rows_kept":0,"cut":false,"hidden":true,"merged":[]}

{"sheet":"Tabelle2","index":11,"n_rows":0,"n_cols":0,"rows_kept":0,"cut":false,"hidden":true,"merged":[]}

{"sheet":"Gesamtkalkulation","index":12,"n_rows":81,"n_cols":14,"rows_kept":81,"cut":false,"hidden":false,"merged":[[34,9,35,9],[38,9,39,9],[32,10,35,13],[16,9,17,9],[18,9,19,9],[20,9,21,9],[26,9,27,9],[32,9,33,9],[8,9,9,9],[3,9,4,9],[10,9,11,9],[12,9,13,9],[14,9,15,9],[41,0,42,4],[65,5,65,8],[63,1,63,3],[63,5,63,8],[41,5,42,6],[41,7,42,8],[44,0,45,4],[44,5,45,6],[44,7,45,8],[36,0,36,4],[36,7,36,8],[38,0,38,4],[38,7,38,8],[40,0,40,4],[40,7,40,8],[30,0,31,4],[30,5,31,6],[30,7,31,8],[34,5,34,6],[34,7,35,8],[35,0,35,2],[35,3,35,4],[35,5,35,6],[32,0,32,4],[32,5,32,6],[32,7,33,8],[33,0,33,2],[33,3,33,4],[33,5,33,6],[20,0,21,4],[20,5,21,6],[20,7,21,8],[26,10,29,13],[28,5,28,6],[28,7,28,8],[23,0,24,4],[23,5,24,6],[23,7,24,8],[26,0,27,4],[26,7,27,8],[26,5,26,6],[27,5,27,6],[18,0,19,4],[18,5,19,6],[18,7,19,8],[14,0,15,4],[14,5,15,6],[14,7,15,8],[16,0,17,4],[16,5,17,6],[16,7,17,8],[0,0,0,8],[1,0,1,8],[2,0,2,8],[0,10,1,12],[0,13,1,13],[12,0,13,4],[12,5,13,6],[12,7,13,8],[8,0,9,4],[8,5,9,6],[8,7,9,8],[10,0,11,4],[10,5,11,6],[10,7,11,8],[3,10,3,13],[5,0,5,4],[5,5,5,6],[5,7,5,8],[6,0,7,4],[6,5,7,6],[6,7,7,8],[3,0,4,4],[3,5,4,6],[3,7,4,8],[6,9,7,9]]}
["Gesamtkalkulation - Auftragsforschung",null,null,null,null,null,null,null,null,null,"Sachkosten Gesamt",null,null,{"$f":"H11+H13+H15+H17+H21","v":0}]
["in Euro",null,null,null,null,null,null,null,null,"AA"]
["Nur grün hinterlegte Felder ausfüllen !                                                                                                       ",null,null,null,null,null,null,null,null,null,"Nur zur Information aufgeführt, bestehend aus:"]
["Personalkosten Stammpersonal LS /Beamte",null,null,null,null,"in Euro",null,{"$f":"Personalkosten!J50","v":0},null,873,"- Gerätenutzungskosten Gesamt"]
[null,null,null,null,null,null,null,null,null,873,"- Materialkosten Gesamt"]
["PersonalkostenStammpersonal LS /Angestellte/HiWi",null,null,null,null,"in Euro",null,{"$f":"Personalkosten!L50","v":0},null,874,"- Fremdleistungskosten Gesamt"]
["Personalkosten Einstellung (direkt auf Projekt) Gesamt (Wissenschaftler/Angestellte/HiWi)",null,null,null,null,"in Euro",null,{"$f":"Personalkosten!N50","v":0},null,"812/822","- sonstigen direkt zurechenbaren Kosten Gesamt"]
[]
["Forschungs- und Lehrzulage  ",null,null,null,null,"in Euro",null,{"$f":"Personalkosten!J54","v":0},null,830]
[]
["Gerätenutzungskosten Gesamt",null,null,null,null,"in Euro",null,{"$f":"Gerätenutzungskosten!I25","v":0},null,950]
[]
["direkte Materialkosten Gesamt",null,null,null,null,"in Euro",null,{"$f":"Materialkosten!G28","v":0},null,943]
[]
["Pauschale für Kleinmaterial (bis 350,00 EUR)",null,null,null,null,"in Euro",null,{"$f":"Materialkosten!G31","v":0},null,944]
{"$rows_left_out":67}
{"sheet":"Tabelle3","index":13,"n_rows":0,"n_cols":0,"rows_kept":0,"cut":false,"hidden":true,"merged":[]}